{"text_format":"1","workbook":"xlsx","n_sheets":18,"sheets":["Instructions","Scorecard (Homes)","Scorecard (Midrise)","Batch - Single Family","Batch - Multifamily","Multifamily HSA","IP","LT","SS","WE","EA","MR","EQ","IN","RP","Water Reduction Calculator","Sampling Reporting Form","Scorecard Data"],"not_rendered":{"charts":0,"images":10,"macros":1,"external_links":3,"defined_names":644,"comments":10,"pivot_tables":0},"unopened":[],"bounds":{"document_bytes":16777216,"sheet_cells":100000,"rows_first":2000,"rows_last":500,"rows_between":2000,"halvings":0,"cell_chars":16384,"cell_head_chars":4096},"cells_cut":0,"cells_raw":0,"read":"whole","date_system":"1900"}

{"sheet":"Instructions","index":0,"n_rows":156,"n_cols":13,"rows_kept":156,"cut":false,"hidden":false,"merged":[[2,4,2,5],[49,4,49,5],[94,8,94,10],[95,8,95,10],[89,8,89,10],[90,8,90,10],[91,8,91,10],[92,8,92,10],[93,8,93,10],[53,2,53,5],[54,2,54,5],[55,2,55,5]]}
[]
[]
[null,null,null,null,"LEED BD+C: Homes and Multifamily v4 Workbook"]
[null,null,null,null,"Step 1."]
[null,null,null,null,"Ensure this project is registered in LEED Online."]
[]
[null,null,null,null,"Step 2."]
[null,null,null,null,"Enable macros"]
{"$rows_left_out":149}
{"sheet":"Scorecard (Homes)","index":1,"n_rows":108,"n_cols":12,"rows_kept":108,"cut":false,"hidden":false,"merged":[[107,1,107,9],[13,11,14,11],[32,11,33,11],[43,11,44,11]]}
[]
[null,"LEED BD+C: Homes and Multifamily Lowrise v4 - LEED v4"]
[null,{"$f":"CONCATENATE(IF(Type=\"Batch\",Instructions!F47,Instructions!F36),\" Scorecard\")","v":"Grand Rapids  Scorecard"}]
[null,"Note: The information on this tab is READ-ONLY.  To edit this information, see the Credit Category tabs."]
[]
[null,null,"Integrative Process",null,"Preliminary    Y",{"$f":"IP!F3","v":1},"M",{"$f":"IP!H3","v":0},"Verified",{"$f":"IP!J3","v":1}]
[]
[null,null,"IPc","Integrative Process",null,{"$f":"IP!$F$7","v":1},null,{"$f":"IP!$H$7","v":0},null,{"$f":"IF(IP!$J$7=0,\"\",IP!$J$7)","v":1}]
{"$rows_left_out":101}
{"sheet":"Scorecard (Midrise)","index":2,"n_rows":92,"n_cols":12,"rows_kept":92,"cut":false,"hidden":true,"merged":[[91,1,91,9],[13,11,14,11],[32,11,33,11]]}
[]
[null,"LEED BD+C: Multifamily Midrise v4 - LEED v4"]
[null,{"$f":"CONCATENATE(IF(Type=\"Batch\",Instructions!F47,Instructions!F36),\" Scorecard\")","v":"Grand Rapids  Scorecard"}]
[null,"Note: The information on this tab is READ-ONLY.  To edit this information, see the Credit Category tabs."]
[]
[null,null,"Integrative Process",null,"Preliminary    Y",{"$f":"IP!F3","v":1},"M",{"$f":"IP!H3","v":0},"Verified",{"$f":"IP!J3","v":1}]
[]
[null,null,"IPc","Integrative Process",null,{"$f":"IP!$F$7","v":1},null,{"$f":"IP!$H$7","v":0},null,{"$f":"IF(IP!$J$7=0,\"\",IP!$J$7)","v":1}]
{"$rows_left_out":85}
{"sheet":"Batch - Single Family","index":3,"n_rows":23,"n_cols":17,"rows_kept":23,"cut":false,"hidden":true,"merged":[[12,6,12,8],[12,9,12,16],[6,1,6,6],[7,1,7,5],[12,1,12,4],[8,1,8,5],[9,1,9,5],[12,5,13,5]]}
[]
[null,"Certification Submittal for Batches of Single Family Homes"]
[null,{"$f":"CONCATENATE(\"Batch Registration Set ID #\",Instructions!F46)","v":"Batch Registration Set ID #"}]
[null,{"$f":"CONCATENATE(\"Building type: \",Instructions!F49)","v":"Building type: "}]
[]
[]
[null,"The following is a list of homes to be submitted for certification as a batch. As per LEED for Homes guidelines, every home in this batch submittal will meet or exceed the performance requirements for every prerequisite and credit awarded on the project checklist. "]
[null,"Total number of homes",null,null,null,null,{"$f":"COUNTA(C15:C21)","v":0}]
{"$rows_left_out":16}
{"sheet":"Batch - Multifamily","index":4,"n_rows":23,"n_cols":12,"rows_kept":23,"cut":false,"hidden":true,"merged":[[6,1,6,11],[12,9,12,10],[7,1,7,5],[8,1,8,5],[9,1,9,5],[12,1,12,7]]}
[]
[null,"Certification Submittal for Batches of Multifamily Buildings"]
[null,{"$f":"CONCATENATE(\"Batch Registration Set ID #\",Instructions!F46)","v":"Batch Registration Set ID #"}]
[null,{"$f":"CONCATENATE(\"Building type: \",Instructions!F49)","v":"Building type: "}]
[]
[]
[null,"The following is a list of homes to be submitted for certification as a batch. As per LEED for Homes guidelines, every building in this batch submittal will meet or exceed the performance requirements for every prerequisite and credit awarded on the project checklist. "]
[null,"Total number of buildings ",null,null,null,null,{"$f":"COUNTA(C15:C22)","v":0}]
{"$rows_left_out":16}
{"sheet":"Multifamily HSA","index":5,"n_rows":14,"n_cols":16,"rows_kept":14,"cut":false,"hidden":false,"merged":[[13,1,13,14],[12,1,12,14],[9,14,9,15],[9,2,9,3],[9,4,9,5],[9,6,9,7],[9,8,9,9],[9,10,9,11],[9,12,9,13],[11,1,11,14],[10,4,10,5],[10,6,10,7],[10,2,10,3],[10,8,10,9],[10,10,10,11],[10,12,10,13],[10,14,10,15],[4,1,4,15],[6,1,7,1],[6,2,6,3],[6,4,6,5],[6,6,6,7],[6,8,6,9],[6,10,6,11],[6,12,6,13],[6,14,6,15]]}
[]
[null,"Multifamily Home Size Adjuster"]
[]
[]
[null,"This approach can be used to determine an overall home size adjuster for  multifamily buildings, but it cannot be used to determine an overall home size adjuster for a complex with multiple multifamily buildings. If a project includes multiple multifamily buildings, each building must have its own home size adjustment. This weighted approach cannot be used for multiple single family homes.\n\nComplete the table for each building in the project.  Input the number of units and the average square footage for units with the corresponding bedroom number. For example, if the building has three 2-bedroom units that are 1300 sq ft, 1400 sq ft, and 1500 sq ft, insert \"3\" in cell G9 and \"1400\" in cell H9. Please leave zeroes or blanks where appropriate."]
[]
[null,"Building ID","0 Bedrooms",null,"1 Bedroom",null,"2 Bedrooms",null,"3 Bedrooms",null,"4 Bedrooms",null,"5 Bedrooms",null,"6 Bedrooms"]
[null,null,"Number \nof Units",{"$f":"CONCATENATE(\"Average \nFloor Area\n\",IF(Instructions!$I$62=1,\" (sq ft)\",\" (sq m)\"))","v":"Average \nFloor Area\n (sq ft)"},"Number \nof Units",{"$f":"CONCATENATE(\"Average \nFloor Area\n\",IF(Instructions!$I$62=1,\" (sq ft)\",\" (sq m)\"))","v":"Average \nFloor Area\n (sq ft)"},"Number \nof Units",{"$f":"CONCATENATE(\"Average \nFloor Area\n\",IF(Instructions!$I$62=1,\" (sq ft)\",\" (sq m)\"))","v":"Average \nFloor Area\n (sq ft)"},"Number \nof Units",{"$f":"CONCATENATE(\"Average \nFloor Area\n\",IF(Instructions!$I$62=1,\" (sq ft)\",\" (sq m)\"))","v":"Average \nFloor Area\n (sq ft)"},"Number \nof Units",{"$f":"CONCATENATE(\"Average \nFloor Area\n\",IF(Instructions!$I$62=1,\" (sq ft)\",\" (sq m)\"))","v":"Average \nFloor Area\n (sq ft)"},"Number \nof Units",{"$f":"CONCATENATE(\"Average \nFloor Area\n\",IF(Instructions!$I$62=1,\" (sq ft)\",\" (sq m)\"))","v":"Average \nFloor Area\n (sq ft)"},"Number \nof Units",{"$f":"CONCATENATE(\"Average \nFloor Area\n\",IF(Instructions!$I$62=1,\" (sq ft)\",\" (sq m)\"))","v":"Average \nFloor Area\n (sq ft)"}]
{"$rows_left_out":7}
{"sheet":"IP","index":6,"n_rows":49,"n_cols":17,"rows_kept":49,"cut":false,"hidden":false,"merged":[[44,3,45,9],[20,3,26,9],[20,15,21,15],[4,1,4,3],[35,15,36,15],[13,3,18,9],[28,3,29,9],[35,3,36,9]]}
[null,"Integrative Process",null,null,null,null,null,null,null,null,null,"Notes","Verified \n(initials)","Date \nVerified","Verification Details","Verification Measure","QAD \nVerification Notes"]
[]
[null,null,null,null,"Preliminary    Y",{"$f":"F7","v":1},"Maybe",{"$f":"H7","v":0},"Verified",{"$f":"J7","v":1}]
[]
["IPc1",{"$f":"IF(RatingSystem=1,HYPERLINK(\"http://www.usgbc.org/node/2612166\",L5),HYPERLINK(\"http://www.usgbc.org/node/2612166\",L5))","v":"IP Credit Integrative Process"},null,null,null,null,null,null,null,null,"HM","IP Credit Integrative Process"]
[null,null,null,null,null,null,null,null,null,null,"HM"]
[null,"Up to 2 points",null,null,"Preliminary    Y",{"$f":"IF(SUM(F11,F33,F42)>2,2,SUM(F11,F33,F42))","v":1},"M",{"$f":"IF(SUM(H11,H33,H42)>2,2,SUM(H11,H33,H42))","v":0},"Verified",{"$f":"IF(SUM(J11,J33,J42)>2,2,SUM(J11,J33,J42))","v":1},"HM",null,"Responsible Party"]
[null,"Exemplary Performance: Achieve all three options",null,null,null,null,null,null,null,null,"HM"]
{"$rows_left_out":42}
{"sheet":"LT","index":7,"n_rows":144,"n_cols":17,"rows_kept":144,"cut":false,"hidden":false,"merged":[[96,3,96,5],[97,3,97,5],[98,3,98,5],[101,3,101,5],[103,3,103,5],[62,3,63,9],[56,3,56,9],[143,3,143,5],[109,3,109,5],[112,3,112,5],[139,3,139,5],[140,3,140,5],[130,3,130,5],[120,3,120,5],[121,3,121,5],[122,3,122,5],[132,1,132,3],[105,3,105,5],[106,3,106,5],[108,3,108,5],[74,3,74,5],[4,1,4,3],[17,1,17,3],[31,1,31,3],[114,1,114,3],[124,1,124,3],[22,2,22,3],[24,2,24,3],[26,2,26,3],[28,2,28,3],[43,3,43,5],[44,3,44,5],[45,3,45,5],[71,3,71,8],[88,3,88,5],[95,2,95,8],[58,3,60,9]]}
[null,"Location and Transportation",null,null,null,null,null,null,null,null,null,"Notes","Verified \n(initials)","Date \nVerified","Verification Details","Verification Measure","QAD \nVerification Notes"]
[]
[null,null,null,null,"Preliminary    Y",{"$f":"IF(LT!$F$20=15,15,SUM(F34,F117,F127,F135))","v":9},"Maybe",{"$f":"IF(H20=15,15,SUM(H20,H34,H117,H127,H135))","v":0},"Verified",{"$f":"IF(J20=15,15,SUM(J20,J34,J117,J127,J135))","v":9}]
[]
["LTp1",{"$f":"IF(RatingSystem=1,HYPERLINK(\"http://www.usgbc.org/node/2612234\",L5),HYPERLINK(\"http://www.usgbc.org/node/2612234\",L5))","v":"LT Prerequisite Floodplain Avoidance"},null,null,null,null,null,null,null,null,"HM","LT Prerequisite Floodplain Avoidance"]
[null,null,null,null,null,null,null,null,null,null,"HM"]
[null,"Required",null,null,null,"Required",null,null,"Verified","Y","HM",null,"Responsible Party"]
[null,null,null,null,null,null,null,null,null,null,"HM"]
{"$rows_left_out":137}
{"sheet":"SS","index":8,"n_rows":133,"n_cols":17,"rows_kept":133,"cut":false,"hidden":false,"merged":[[55,3,55,8],[59,3,59,8],[61,3,61,8],[128,3,128,9],[106,3,106,8],[111,3,111,8],[116,3,116,8],[113,3,114,9],[118,3,119,9],[83,3,83,7],[79,3,79,7],[82,3,82,7],[121,3,123,9],[125,3,126,9],[131,3,132,9],[18,3,19,9],[25,3,26,9],[28,3,29,9],[103,3,104,9],[108,3,109,9],[90,3,90,7],[99,3,99,8],[101,3,101,8],[78,3,78,7],[84,3,84,7],[53,3,53,8],[21,3,21,8],[36,3,36,8],[60,3,60,8],[77,3,77,7],[4,1,4,3],[31,1,31,3],[38,1,38,3],[66,1,66,3],[92,1,92,3],[10,3,10,8],[12,3,12,8],[16,3,16,8],[14,3,14,9],[46,3,46,8],[52,3,52,8],[76,3,76,7],[62,3,62,8],[63,3,63,8],[64,3,64,8],[54,3,54,8]]}
[null,"Sustainable Sites",null,null,null,null,null,null,null,null,null,"Notes","Verified \n(initials)","Date \nVerified","Verification Details","Verification Measure","QAD \nVerification Notes"]
[]
[null,null,null,null,"Preliminary    Y",{"$f":"SUM(F41,F69,F95)","v":1.5},"Maybe",{"$f":"SUM(H41,H69,H95)","v":0},"Verified",{"$f":"SUM(J41,J69,J95)","v":1.5}]
[]
["SSp1",{"$f":"IF(RatingSystem=1,HYPERLINK(\"http://www.usgbc.org/node/2612260\",L5),HYPERLINK(\"http://www.usgbc.org/node/2612260\",L5))","v":"SS Prerequisite Construction Activity Pollution Prevention "},null,null,null,null,null,null,null,null,"HM","SS Prerequisite Construction Activity Pollution Prevention "]
[null,null,null,null,null,null,null,null,null,null,"HM"]
[null,"Required",null,null,null,"Required",null,null,"Verified","Y","HM",null,"Responsible Party"]
[null,null,null,null,null,null,null,null,null,null,"HM"]
{"$rows_left_out":126}
{"sheet":"WE","index":9,"n_rows":90,"n_cols":17,"rows_kept":90,"cut":false,"hidden":false,"merged":[[88,3,88,7],[48,3,48,7],[49,3,49,7],[52,3,52,7],[53,3,53,7],[56,3,56,7],[57,3,57,7],[60,3,60,7],[81,3,81,7],[70,3,70,7],[73,3,73,7],[67,2,67,8],[66,2,66,8],[74,3,74,7],[77,3,77,7],[78,3,78,7],[4,1,4,3],[24,1,24,3],[37,1,37,3],[83,1,83,3],[30,3,30,8],[45,3,45,8],[69,3,69,7],[33,3,34,9]]}
[null,"Water Efficiency",null,null,null,null,null,null,null,null,null,"Notes","Verified \n(initials)","Date \nVerified","Verification Details","Verification Measure","QAD \nVerification Notes"]
[]
[null,null,null,null,"Preliminary    Y",{"$f":"IF(WE!$F$27>0,WE!$F$27,SUM(F40,F86))","v":5},"Maybe",{"$f":"IF(WE!$H$27>0,WE!$H$27,SUM(H40,H86))","v":0},"Verified",{"$f":"IF(WE!$J$27>0,WE!$J$27,SUM(J40,J86))","v":5}]
[]
["WEp1",{"$f":"IF(RatingSystem=1,HYPERLINK(\"http://www.usgbc.org/node/2612787\",L5),HYPERLINK(\"http://www.usgbc.org/node/2612787\",L5))","v":"WE Prerequisite Water Metering"},null,null,null,null,null,null,null,null,"HM","WE Prerequisite Water Metering"]
[null,null,null,null,null,null,null,null,null,null,"HM"]
[null,"Required",null,null,null,"Required",null,null,"Verified",{"$f":"IF(OR(J10=\"Y\",J18=\"Y\"),\"Y\",\"N\")","v":"Y"},"HM",null,"Responsible Party"]
[null,null,null,null,null,null,null,null,null,null,"HM"]
{"$rows_left_out":83}
{"sheet":"EA","index":10,"n_rows":486,"n_cols":17,"rows_kept":486,"cut":false,"hidden":false,"merged":[[294,1,294,3],[307,1,307,3],[485,3,485,7],[408,3,408,7],[418,3,418,7],[469,3,469,7],[471,3,471,7],[473,3,473,7],[483,3,483,7],[422,3,422,8],[409,3,410,9],[442,3,443,9],[463,1,463,3],[475,1,475,3],[395,3,395,7],[396,3,396,7],[11,3,11,7],[13,3,13,7],[14,3,14,7],[95,3,95,8],[21,3,21,7],[22,3,22,7],[23,3,23,7],[27,3,27,7],[16,3,16,7],[31,3,31,7],[35,3,35,7],[33,3,33,8],[66,3,66,7],[128,3,128,7],[129,3,129,7],[131,3,131,7],[93,3,94,9],[268,3,268,7],[267,2,267,9],[213,3,213,9],[243,3,243,7],[261,3,261,7],[231,3,231,8],[222,3,222,7],[178,2,179,3],[146,3,146,9],[186,2,187,3],[215,3,216,9],[233,3,234,9],[4,1,4,3],[70,1,70,3],[88,1,88,3],[98,1,98,3],[122,1,122,3],[56,3,56,7],[49,3,49,8],[51,3,52,9],[54,3,54,9],[59,3,60,9],[63,3,63,9],[107,3,107,7],[108,3,108,7],[115,3,115,7],[42,3,42,8],[68,3,68,7],[134,1,134,3],[200,1,200,3],[251,1,251,3],[270,1,270,3],[283,1,283,3],[165,3,165,8],[144,3,144,8],[148,3,150,9],[275,2,275,3],[277,2,277,3],[279,2,279,7],[280,2,280,8],[249,3,249,9],[152,3,153,9],[163,3,164,9],[300,3,300,8],[302,3,302,7],[384,1,384,3],[412,1,412,3],[425,1,425,3],[331,1,331,3],[340,1,340,3],[360,1,360,3],[338,3,338,7],[304,3,305,9],[366,3,366,7],[365,3,365,7]]}
[null,"Energy and Atmosphere",null,null,null,null,null,null,null,null,null,"Notes","Verified \n(initials)","Date \nVerified","Verification Details","Verification Measure","QAD \nVerification Notes"]
[]
[null,null,null,null,"Preliminary    Y",{"$f":"IF(Instructions!$J$62=2,IF((F125+F137+F203)>37,37,F125+F137+F203),IF(F101<>0,IF((F101+F137+F203+F254+F273)>38,38,F101+F137+F203+F254+F273),IF((F137+F203+F254+F273+F286+F297+F310+F334+F343+F363+F387+F415+F428+F466+F478)>38,38,F137+F203+F254+F273+F286+F297+F310+F334+F343+F363+F387+F415+F428+F466+F478)))","v":30},"Maybe",{"$f":"IF(Instructions!$J$62=2,IF((H125+H137+H203)>37,37,H125+H137+H203),IF(H101<>0,IF((H101+H137+H203+H254+H273)>38,38,H101+H137+H203+H254+H273),IF((H137+H203+H254+H273+H286+H297+H310+H334+H343+H363+H387+H415+H428+H466+H478)>38,38,H137+H203+H254+H273+H286+H297+H310+H334+H343+H363+H387+H415+H428+H466+H478)))","v":0},"Verified",{"$f":"IF(Instructions!$J$62=2,IF((J125+J137+J203)>37,37,J125+J137+J203),IF(J101<>0,IF((J101+J137+J203+J254+J273)>38,38,J101+J137+J203+J254+J273),IF((J137+J203+J254+J273+J286+J297+J310+J334+J343+J363+J387+J415+J428+J466+J478)>38,38,J137+J203+J254+J273+J286+J297+J310+J334+J343+J363+J387+J415+J428+J466+J478)))","v":30}]
[]
["EAp1",{"$f":"IF(RatingSystem=1,HYPERLINK(\"http://www.usgbc.org/node/2611842\",L5),HYPERLINK(\"http://www.usgbc.org/node/2611843\",L5))","v":"EA Prerequisite Minimum Energy Performance"},null,null,null,null,null,null,null,null,"HM","EA Prerequisite Minimum Energy Performance"]
[null,null,null,null,null,null,null,null,null,null,"HM"]
[null,"Required",null,null,null,"Required",null,null,"Verified","Y","HM",null,"Responsible Party"]
[null,null,null,null,null,null,null,null,null,null,"HM"]
{"$rows_left_out":479}
{"sheet":"MR","index":11,"n_rows":128,"n_cols":17,"rows_kept":128,"cut":false,"hidden":false,"merged":[[117,3,117,8],[82,2,83,2],[127,3,127,6],[120,3,120,6],[121,3,121,6],[122,3,122,6],[125,3,125,6],[126,3,126,6],[82,3,82,6],[83,3,83,6],[84,2,85,2],[84,3,84,6],[85,3,85,6],[86,2,87,2],[86,3,86,6],[88,2,89,2],[68,2,69,2],[68,3,68,6],[69,3,69,6],[70,2,71,2],[70,3,70,6],[71,3,71,6],[62,3,62,6],[63,3,63,6],[64,3,64,6],[65,3,65,6],[52,3,52,6],[26,3,27,9],[81,3,81,6],[79,2,79,6],[72,2,73,2],[72,3,72,6],[73,3,73,6],[74,2,75,2],[74,3,74,6],[75,3,75,6],[29,3,30,9],[39,3,40,9],[62,2,63,2],[64,2,65,2],[66,2,67,2],[66,3,66,6],[67,3,67,6],[80,3,80,6],[115,3,116,9],[9,3,9,9],[113,3,113,8],[114,3,114,8],[99,3,99,6],[101,3,101,6],[102,3,102,6],[103,3,103,6],[104,3,104,6],[87,3,87,6],[61,3,61,6],[24,3,24,8],[32,3,32,8],[19,3,20,9],[22,3,22,9],[16,3,16,8],[106,1,106,3],[4,1,4,3],[11,1,11,3],[34,1,34,3],[42,1,42,3],[93,1,93,3],[88,3,88,6],[89,3,89,6],[90,2,91,2],[90,3,90,6],[91,3,91,6],[76,2,77,2],[76,3,76,6],[77,3,77,6],[80,2,81,2]]}
[null,"Materials and Resources",null,null,null,null,null,null,null,null,null,"Notes","Verified \n(initials)","Date \nVerified","Verification Details","Verification Measure","QAD \nVerification Notes"]
[]
[null,null,null,null,"Preliminary    Y",{"$f":"SUM(F37,F45,F109,F96)","v":5},"Maybe",{"$f":"SUM(H37,H45,H109,H96)","v":0},"Verified",{"$f":"SUM(J37,J45,J109,J96)","v":5}]
[]
["MRp1",{"$f":"IF(RatingSystem=1,HYPERLINK(\"http://www.usgbc.org/node/2612898\",L5),HYPERLINK(\"http://www.usgbc.org/node/2612898\",L5))","v":"MR Prerequisite Certified Tropical Wood"},null,null,null,null,null,null,null,null,"HM","MR Prerequisite Certified Tropical Wood"]
[null,null,null,null,null,null,null,null,null,null,"HM"]
[null,"Required",null,null,null,"Required",null,null,"Verified","Y","HM",null,"Responsible Party"]
[null,null,null,null,null,null,null,null,null,null,"HM"]
{"$rows_left_out":121}
{"sheet":"EQ","index":12,"n_rows":430,"n_cols":17,"rows_kept":430,"cut":false,"hidden":false,"merged":[[95,3,95,7],[97,3,97,7],[67,3,67,7],[69,3,69,7],[73,3,73,7],[75,3,75,7],[77,3,77,7],[86,3,86,7],[87,3,87,7],[90,3,90,7],[93,3,93,7],[304,3,304,7],[323,3,323,7],[325,3,325,7],[327,3,327,7],[306,3,306,8],[309,1,309,3],[12,3,12,8],[19,3,19,8],[21,3,21,8],[35,3,36,9],[23,3,24,9],[16,3,17,9],[42,3,44,9],[63,3,63,7],[64,3,64,7],[213,3,213,7],[221,3,221,7],[118,3,118,7],[128,3,128,7],[131,3,131,7],[133,3,133,7],[142,3,142,7],[143,3,143,7],[151,3,151,7],[269,3,269,7],[270,3,270,7],[279,3,279,7],[296,3,296,7],[224,3,224,7],[232,3,232,7],[226,3,226,8],[245,3,245,8],[281,1,281,3],[288,1,288,3],[332,3,332,8],[370,3,370,7],[400,3,400,7],[402,3,402,7],[410,3,410,8],[381,3,381,7],[383,3,383,7],[392,3,392,7],[375,3,375,8],[357,3,357,7],[366,3,366,7],[368,3,368,7],[339,3,339,7],[428,3,429,9],[394,3,394,9],[390,3,390,9],[50,3,50,9],[359,3,359,9],[372,3,373,9],[418,3,419,9],[305,3,305,9],[329,3,330,9],[355,3,355,9],[202,3,203,9],[205,3,205,9],[247,3,248,9],[272,3,273,9],[153,3,154,9],[121,3,122,9],[426,3,426,7],[412,3,412,7],[414,3,414,7],[416,3,416,8],[341,3,341,7],[343,3,343,7],[404,1,404,3],[421,1,421,3],[145,1,145,3],[158,1,158,3],[174,1,174,3],[193,1,193,3],[234,1,234,3],[4,1,4,3],[56,1,56,3],[79,1,79,3],[99,1,99,3],[135,1,135,3],[156,3,156,7],[166,3,166,7],[168,3,168,7],[182,2,182,3],[164,3,164,8],[182,4,183,9],[191,3,191,7],[211,3,211,7],[188,3,189,9],[119,3,119,9],[117,3,117,7],[38,3,38,8],[40,3,40,8],[114,3,114,7]]}
[null,"Indoor Environmental Quality",null,null,null,null,null,null,null,null,null,"Notes","Verified \n(initials)","Date \nVerified","Verification Details","Verification Measure","QAD \nVerification Notes"]
[]
[null,null,null,null,"Preliminary    Y",{"$f":"SUM(F424,F407,F312,F291,F284,F237,F196,F177)","v":10.5},"Maybe",{"$f":"SUM(H424,H407,H312,H291,H284,H237,H196,H177)","v":0},"Verified",{"$f":"SUM(J424,J407,J312,J291,J284,J237,J196,J177)","v":10.5}]
[]
["EQp1",{"$f":"IF(RatingSystem=1,HYPERLINK(\"http://www.usgbc.org/node/2612401\",L5),HYPERLINK(\"http://www.usgbc.org/node/2612401\",L5))","v":"EQ Prerequisite Ventilation"},null,null,null,null,null,null,null,null,"HM","EQ Prerequisite Ventilation"]
[null,null,null,null,null,null,null,null,null,null,"HM"]
[null,"Required",null,null,null,"Required",null,null,"Verified",{"$f":"IF(OR(J10=\"Y\",J31=\"Y\"),\"Y\",\"N\")","v":"Y"},"HM",null,"Responsible Party"]
[null,null,null,null,null,null,null,null,null,null,"HM"]
{"$rows_left_out":423}
{"sheet":"IN","index":13,"n_rows":56,"n_cols":17,"rows_kept":56,"cut":false,"hidden":false,"merged":[[55,2,55,4],[45,2,45,4],[26,2,26,4],[33,2,33,4],[32,2,32,4],[44,2,44,4],[41,2,41,4],[42,2,42,4],[38,2,38,4],[39,2,39,4],[35,2,35,4],[36,2,36,4],[4,1,4,3],[11,1,11,3],[50,1,50,3],[20,2,20,4],[19,2,19,4],[47,2,47,4],[48,2,48,4]]}
[null,"Innovation",null,null,null,null,null,null,null,null,null,"Notes","Verified \n(initials)","Date \nVerified","Verification Details","Verification Measure","QAD \nVerification Notes"]
[]
[null,null,null,null,"Preliminary    Y",{"$f":"SUM(F14,F53)","v":2},"Maybe",{"$f":"SUM(H14,H53)","v":0},"Verified",{"$f":"SUM(J14,J53)","v":2}]
[]
["INp1",{"$f":"IF(RatingSystem=1,HYPERLINK(\"http://www.usgbc.org/node/2613096\",L5),HYPERLINK(\"http://www.usgbc.org/node/2613096\",L5))","v":"IN Prerequisite Preliminary Rating"},null,null,null,null,null,null,null,null,"HM","IN Prerequisite Preliminary Rating"]
[null,null,null,null,null,null,null,null,null,null,"HM"]
[null,"Required",null,null,null,"Required",null,null,"Verified","Y","HM",null,"Responsible Party"]
[null,null,null,null,null,null,null,null,null,null,"HM"]
{"$rows_left_out":49}
{"sheet":"RP","index":14,"n_rows":19,"n_cols":17,"rows_kept":19,"cut":false,"hidden":false,"merged":[[4,1,4,3],[9,2,9,9],[17,2,17,3],[18,2,18,3],[14,2,14,3],[15,2,15,3],[10,2,10,3],[11,2,11,3],[12,2,12,3],[13,2,13,3],[16,2,16,3]]}
[null,"Regional Priority",null,null,null,null,null,null,null,null,null,"Notes","Verified \n(initials)","Date \nVerified","Verification Details","Verification Measure","QAD \nVerification Notes"]
[]
[null,null,null,null,"Preliminary    Y",{"$f":"F7","v":3},"Maybe",{"$f":"H7","v":0},"Verified",{"$f":"J7","v":3}]
[]
["RPc1",{"$f":"IF(RatingSystem=1,HYPERLINK(\"http://www.usgbc.org/node/2613197\",L5),HYPERLINK(\"http://www.usgbc.org/node/2613197\",L5))","v":"RP Credit Regional Priority"},null,null,null,null,null,null,null,null,"HM","RP Credit Regional Priority"]
[null,null,null,null,null,null,null,null,null,null,"HM"]
[null,"Up to 4 points",null,null,"Preliminary    Y",3,"M",0,"Verified",3,"HM",null,"Responsible Party"]
[null,null,null,null,null,null,null,null,null,null,"HM"]
{"$rows_left_out":12}
{"sheet":"Water Reduction Calculator","index":15,"n_rows":150,"n_cols":23,"rows_kept":150,"cut":false,"hidden":false,"merged":[[78,15,79,15],[78,5,78,6],[78,7,78,8],[78,9,78,10],[78,11,78,12],[78,13,79,13],[77,15,77,17],[78,19,79,19],[78,16,79,16],[97,21,98,21],[97,17,98,17],[97,13,98,13],[97,14,98,14],[97,5,97,6],[97,7,97,8],[97,9,97,10],[97,11,97,12],[116,21,117,21],[115,15,115,17],[116,5,116,6],[116,7,116,8],[116,9,116,10],[116,11,116,12],[116,15,117,15],[116,16,117,16],[116,17,117,17],[116,13,117,13],[116,14,117,14],[115,18,115,19],[78,21,79,21],[78,4,79,4],[66,1,66,4],[116,18,117,18],[116,19,117,19],[35,18,35,19],[35,15,35,17],[53,1,53,4],[53,5,53,14],[54,5,54,6],[54,7,54,8],[54,9,54,10],[54,11,54,12],[54,13,55,13],[53,15,53,17],[53,18,53,19],[36,1,37,1],[36,3,37,3],[96,15,96,17],[96,18,96,19],[97,18,98,18],[97,19,98,19],[97,15,98,15],[97,16,98,16],[36,7,36,8],[36,9,36,10],[36,11,36,12],[78,17,79,17],[78,18,79,18],[77,18,77,19],[97,1,98,1],[97,2,98,2],[97,4,98,4],[97,3,98,3],[78,1,79,1],[78,2,79,2],[89,1,89,2],[36,13,37,13],[77,1,77,4],[54,1,55,1],[78,3,79,3],[54,3,55,3],[36,2,37,2],[54,16,55,16],[54,19,55,19],[54,15,55,15],[54,14,55,14],[78,14,79,14],[54,21,55,21],[54,4,55,4],[54,18,55,18],[54,17,55,17],[4,1,4,8],[9,1,9,7],[10,1,10,7],[8,1,8,7],[7,1,7,6],[35,1,35,4],[54,2,55,2],[13,1,13,3],[25,1,25,3],[27,1,27,2],[34,1,34,4],[36,21,37,21],[36,4,37,4],[36,14,37,14],[36,15,37,15],[36,16,37,16],[36,17,37,17],[36,18,37,18],[36,19,37,19],[36,5,36,6],[132,1,132,5],[127,1,127,5],[128,1,128,5],[129,1,129,5],[130,1,130,5],[131,1,131,5],[96,1,96,4],[143,9,143,10],[143,5,143,8],[143,1,144,1],[143,2,144,4],[144,7,144,8],[144,5,144,6],[136,1,136,5],[137,1,137,5],[138,1,138,5],[139,1,139,5],[140,1,140,7],[115,1,115,4],[116,1,117,1],[116,2,117,2],[116,4,117,4],[108,1,108,2],[116,3,117,3]]}
[]
[null,"Water Reduction Calculator"]
[]
[]
[null,"Use this calculator to determine if your building uses less water than the requirements of  WE Credit Total Water Use.\n\nNote:  This calculator is a relative measure of water use based on how the products are designed and not how they actually perform in the field.  Therefore, please use values/rates from the product specifications.  Measurements from field testing should NOT be used in this calculator, but may be used to identify improperly installed or malfunctioning products.  "]
[]
[null,"Outdoor Water Use"]
[null,"Provide the following values from the WaterSense Water Budget Calculator"]
{"$rows_left_out":143}
{"sheet":"Sampling Reporting Form","index":16,"n_rows":22,"n_cols":13,"rows_kept":22,"cut":false,"hidden":false,"merged":[[4,6,5,6],[4,7,4,9],[4,12,5,12],[4,10,4,11],[4,1,5,1],[4,2,5,2],[4,3,5,3],[4,4,5,4],[4,5,5,5]]}
[]
[null,"Sampling Reporting Form"]
[]
[]
[null,"Sample Set","Size of\nSample Set\n(Number of Lots/Units)","Lot/Unit Numbers \nwithin \nSample Set","Sampling \nRate\n(%)","Number of \nUnits or Buildings Verified","Lot/Unit Numbers\nVerified","On-site Verification",null,null,"Failures",null,"Notes"]
[null,null,null,null,null,null,null,"Pre-Slab\nVerification Date","Pre-Drywall\nVerification Date","Final\nVerification Date","Lot/Unit Number \nof any Failures","Remediation Activity\nfor Failure"]
[{"$f":"IF(B7=1,0,0)","v":0},1]
[{"$f":"IF(B8=1,0,0)","v":0},2]
{"$rows_left_out":15}
{"sheet":"Scorecard Data","index":17,"n_rows":619,"n_cols":17,"rows_kept":619,"cut":false,"hidden":true,"merged":[]}
["Project ID #",{"$f":"Instructions!F34","v":"Woodlawn Residence "}]
["Units",{"$f":"Instructions!F12","v":"IP units"}]
["Rating System",{"$f":"Instructions!F15","v":"LEED BD+C: Homes and Multifamily Lowrise v4 - LEED v4"}]
["Building type",{"$f":"IF(Type=\"Batch\",Instructions!F49,Instructions!F41)","v":1}]
["Project name",{"$f":"Instructions!F35","v":"537 Woodlawn"}]
["Project address",{"$f":"Instructions!F36","v":"Grand Rapids "}]
["City",{"$f":"Instructions!F37","v":"Michigan "}]
["State",{"$f":"Instructions!F38","v":"USA"}]
{"$rows_left_out":611}